{"text_format":"1","workbook":"xlsx","n_sheets":10,"sheets":["RIVN_DCF","RIVN_Forecast","RIVN_Forecast_Scenario","RIVN_Comps","Option_Value","Warrant_Value","Convertible_Debt","RIVN_IS","RIVN_BS","RIVN_CFS"],"not_rendered":{"charts":0,"images":1,"macros":1,"external_links":0,"defined_names":49,"comments":3,"pivot_tables":0},"unopened":[],"bounds":{"document_bytes":16777216,"sheet_cells":100000,"rows_first":2000,"rows_last":500,"rows_between":2000,"halvings":0,"cell_chars":16384,"cell_head_chars":4096},"cells_cut":0,"cells_raw":0,"read":"whole","date_system":"1900"}

{"sheet":"RIVN_DCF","index":0,"n_rows":180,"n_cols":27,"rows_kept":180,"cut":false,"hidden":false,"merged":[]}
[]
[null,"Company Name","Rivian Automotive"]
[null,"Ticker","RIVN"]
[null,"Share Price",14.68]
[null,"Valuation Date ","2025-09-30"]
[]
[null,{"$f":"C2&\" (\"&C3&\") DISCOUNTED CASH FLOWS MODEL\"","v":"Rivian Automotive (RIVN) DISCOUNTED CASH FLOWS MODEL"}]
[null,"Fiscal year ends in December USD in millions except per share data."]
[]
["x","FORECASTING CASH FLOWS"]
[]
[null,"  Cost of Revenues: Software Service",null,null,null,"Historical",null,null,null,null,"Projected"]
[]
[null,null,null,null,null,2020,{"$f":"F14+1","v":2021},2022,2023,2024,2025,2026,2027,2028,2029,{"$f":"O14+1","v":2030},{"$f":"P14+1","v":2031},{"$f":"Q14+1","v":2032},{"$f":"R14+1","v":2033},{"$f":"S14+1","v":2034},2035,2036,2037]
[null,"Revenues: Automotive",null,null,null,{"$f":"INDEX(RIVN_IS!$A$14:$G$55,MATCH(RIVN_DCF!$B15,RIVN_IS!$A$14:$A$55,0),MATCH(RIVN_DCF!F$14,RIVN_IS!$A$14:$G$14,0))","v":"-"},{"$f":"INDEX(RIVN_IS!$A$14:$G$55,MATCH(RIVN_DCF!$B15,RIVN_IS!$A$14:$A$55,0),MATCH(RIVN_DCF!G$14,RIVN_IS!$A$14:$G$14,0))","v":0},{"$f":"INDEX(RIVN_IS!$A$14:$G$55,MATCH(RIVN_DCF!$B15,RIVN_IS!$A$14:$A$55,0),MATCH(RIVN_DCF!H$14,RIVN_IS!$A$14:$G$14,0))","v":1554},{"$f":"INDEX(RIVN_IS!$A$14:$G$55,MATCH(RIVN_DCF!$B15,RIVN_IS!$A$14:$A$55,0),MATCH(RIVN_DCF!I$14,RIVN_IS!$A$14:$G$14,0))","v":4132},{"$f":"INDEX(RIVN_IS!$A$14:$G$55,MATCH(RIVN_DCF!$B15,RIVN_IS!$A$14:$A$55,0),MATCH(RIVN_DCF!J$14,RIVN_IS!$A$14:$G$14,0))","v":4486},{"$f":"J15*(1+K37)","v":3647.4926011766806},5614.3839860937787,7999.013561528086,12292.702025758019,16150.973305421234,20164.093540969403,23519.049287551839,26970.666625671231,30557.765286885504,34621.948070041275,38084.142877045408,41130.874307209044,43187.418022569494]
[null,"Revenues: Software Service",null,null,null,{"$f":"INDEX(RIVN_IS!$A$14:$G$55,MATCH(RIVN_DCF!$B16,RIVN_IS!$A$14:$A$55,0),MATCH(RIVN_DCF!F$14,RIVN_IS!$A$14:$G$14,0))","v":"-"},{"$f":"INDEX(RIVN_IS!$A$14:$G$55,MATCH(RIVN_DCF!$B16,RIVN_IS!$A$14:$A$55,0),MATCH(RIVN_DCF!G$14,RIVN_IS!$A$14:$G$14,0))","v":"-"},{"$f":"INDEX(RIVN_IS!$A$14:$G$55,MATCH(RIVN_DCF!$B16,RIVN_IS!$A$14:$A$55,0),MATCH(RIVN_DCF!H$14,RIVN_IS!$A$14:$G$14,0))","v":104},{"$f":"INDEX(RIVN_IS!$A$14:$G$55,MATCH(RIVN_DCF!$B16,RIVN_IS!$A$14:$A$55,0),MATCH(RIVN_DCF!I$14,RIVN_IS!$A$14:$G$14,0))","v":302},{"$f":"INDEX(RIVN_IS!$A$14:$G$55,MATCH(RIVN_DCF!$B16,RIVN_IS!$A$14:$A$55,0),MATCH(RIVN_DCF!J$14,RIVN_IS!$A$14:$G$14,0))","v":484},{"$f":"J16*(1+K38)","v":1388},2082,3123,4684.5,6558.2999999999993,8525.7899999999991,10657.237499999999,13321.546875,16651.93359375,20814.9169921875,24977.900390625,29973.48046875,35968.176562499997]
[null,"  Total Revenues",null,null,null,{"$f":"INDEX(RIVN_IS!$A$14:$G$55,MATCH(RIVN_DCF!$B17,RIVN_IS!$A$14:$A$55,0),MATCH(RIVN_DCF!F$14,RIVN_IS!$A$14:$G$14,0))","v":0},{"$f":"INDEX(RIVN_IS!$A$14:$G$55,MATCH(RIVN_DCF!$B17,RIVN_IS!$A$14:$A$55,0),MATCH(RIVN_DCF!G$14,RIVN_IS!$A$14:$G$14,0))","v":55},{"$f":"INDEX(RIVN_IS!$A$14:$G$55,MATCH(RIVN_DCF!$B17,RIVN_IS!$A$14:$A$55,0),MATCH(RIVN_DCF!H$14,RIVN_IS!$A$14:$G$14,0))","v":1658},{"$f":"INDEX(RIVN_IS!$A$14:$G$55,MATCH(RIVN_DCF!$B17,RIVN_IS!$A$14:$A$55,0),MATCH(RIVN_DCF!I$14,RIVN_IS!$A$14:$G$14,0))","v":4434},{"$f":"INDEX(RIVN_IS!$A$14:$G$55,MATCH(RIVN_DCF!$B17,RIVN_IS!$A$14:$A$55,0),MATCH(RIVN_DCF!J$14,RIVN_IS!$A$14:$G$14,0))","v":4970},{"$f":"K16+K15","v":5035.4926011766802},{"$f":"L16+L15","v":7696.3839860937787},11122.013561528085,16977.202025758019,22709.273305421233,28689.8835409694,34176.286787551842,40292.213500671234,47209.698880635508,55436.865062228775,63062.043267670408,71104.354775959044,79155.594585069484]
[null,"  Cost of Revenues: Automotive",null,null,null,{"$f":"INDEX(RIVN_IS!$A$14:$G$55,MATCH(RIVN_DCF!$B18,RIVN_IS!$A$14:$A$55,0),MATCH(RIVN_DCF!F$14,RIVN_IS!$A$14:$G$14,0))","v":0},{"$f":"INDEX(RIVN_IS!$A$14:$G$55,MATCH(RIVN_DCF!$B18,RIVN_IS!$A$14:$A$55,0),MATCH(RIVN_DCF!G$14,RIVN_IS!$A$14:$G$14,0))","v":520},{"$f":"INDEX(RIVN_IS!$A$14:$G$55,MATCH(RIVN_DCF!$B18,RIVN_IS!$A$14:$A$55,0),MATCH(RIVN_DCF!H$14,RIVN_IS!$A$14:$G$14,0))","v":4666},{"$f":"INDEX(RIVN_IS!$A$14:$G$55,MATCH(RIVN_DCF!$B18,RIVN_IS!$A$14:$A$55,0),MATCH(RIVN_DCF!I$14,RIVN_IS!$A$14:$G$14,0))","v":6150},{"$f":"INDEX(RIVN_IS!$A$14:$G$55,MATCH(RIVN_DCF!$B18,RIVN_IS!$A$14:$A$55,0),MATCH(RIVN_DCF!J$14,RIVN_IS!$A$14:$G$14,0))","v":5693},{"$f":"K15*K40","v":4012.2418612943488},5052.9455874844007,6799.1615272988729,10448.796721894316,12920.778644336988,16131.274832775523,18815.239430041471,21576.533300536987,24446.212229508405,27697.558456033021,30467.314301636328,32904.699445767234,34549.9344180556]
[null,"  Cost of Revenues: Software Service",null,null,null,{"$f":"INDEX(RIVN_IS!$A$14:$G$55,MATCH(RIVN_DCF!$B19,RIVN_IS!$A$14:$A$55,0),MATCH(RIVN_DCF!F$14,RIVN_IS!$A$14:$G$14,0))","v":0},{"$f":"INDEX(RIVN_IS!$A$14:$G$55,MATCH(RIVN_DCF!$B19,RIVN_IS!$A$14:$A$55,0),MATCH(RIVN_DCF!G$14,RIVN_IS!$A$14:$G$14,0))","v":0},{"$f":"INDEX(RIVN_IS!$A$14:$G$55,MATCH(RIVN_DCF!$B19,RIVN_IS!$A$14:$A$55,0),MATCH(RIVN_DCF!H$14,RIVN_IS!$A$14:$G$14,0))","v":115},{"$f":"INDEX(RIVN_IS!$A$14:$G$55,MATCH(RIVN_DCF!$B19,RIVN_IS!$A$14:$A$55,0),MATCH(RIVN_DCF!I$14,RIVN_IS!$A$14:$G$14,0))","v":314},{"$f":"INDEX(RIVN_IS!$A$14:$G$55,MATCH(RIVN_DCF!$B19,RIVN_IS!$A$14:$A$55,0),MATCH(RIVN_DCF!J$14,RIVN_IS!$A$14:$G$14,0))","v":477},{"$f":"K16*K41","v":1110.4000000000001},1457.3999999999999,2186.1,3044.9250000000002,3934.9799999999996,5115.4739999999993,6394.3424999999997,7992.9281249999995,9991.16015625,12488.9501953125,14986.740234375,17984.088281249999,21580.905937499996]
[null,"Gross Profit",null,null,null,{"$f":"F17-F18-F19","v":0},-465,-3123,-2030,-1200,-87.149260117668746,1186.0383986093782,2136.7520342292123,3483.4803038637028,5853.5146610842457,7443.1347081938775,8966.7048575103727,10722.752075134249,12772.326494877103,15250.356410883254,17607.988731659079,20215.567048941812,23024.754229513888]
{"$rows_left_out":161}
{"sheet":"RIVN_Forecast","index":1,"n_rows":114,"n_cols":17,"rows_kept":114,"cut":false,"hidden":false,"merged":[]}
[]
[null,"Key Metrics (Annual)"]
[null,"Dollars in millions",null,"Actual",null,null,null,"Projected"]
[null,null,null,2021,2022,2023,2024,2025,2026,2027,2028,2029,2030,2031,2032,2033,2034]
[null,"Production",null,1015,24337,57232,49476]
[null,"Delivery",null,920,20332,50122,51579,44000,{"$f":"I7+I9+I11","v":81800},{"$f":"J7+J9+J11","v":121070},{"$f":"K7+K9+K11+K16","v":162154.5},190160.55499999999,216226.01425000001,244748.61567500001,269223.47724250006,296145.82496675005,325760.40746342507]
[null," R1",null,null,null,{"$f":"F6-F9","v":43332},{"$f":"G6-G9","v":40361},{"$f":"H6-H9","v":32000},35000,{"$f":"I7*(1+J8)","v":39200.000000000007},43904.000000000015,49172.480000000018,54089.728000000025,59498.700800000035,65448.570880000043,71993.427968000047,79192.770764800065]
[null,"  R1 Growth",null,null,null,null,null,null,null,0.12,0.12,0.12,0.1,0.1,0.1,0.1,0.1]
[null," RCV or EDV",null,null,null,{"$f":"SUM(G58:J58)","v":6790},{"$f":"SUM(K58:N58)","v":11218},12000,{"$f":"H9*(1+I10)","v":13799.999999999998},15869.999999999996,18250.499999999993,20988.07499999999,24136.286249999986,26549.914874999988,29204.906362499987,32125.396998749988,35337.936698624988]
[null,"  RCV Growth",null,null,null,null,{"$f":"G9/F9-1","v":0.65213549337260668},{"$f":"H9/G9-1","v":6.9709395614191427E-2},0.15,0.15,0.15,0.15,0.15,0.1,0.1,0.1,0.1]
[null," R2",null,null,null,null,null,null,33000,66000,100000,{"$f":"K11*(1+L12)","v":120000},138000,158700,174570,192027.00000000003,211229.70000000004]
[null,"  R2 Growth",null,null,null,null,null,null,null,null,null,0.2,0.15,0.15,0.1,0.1,0.1]
[null," R3",null,null,null,null,null,null,null,null,33000,66000,100000,{"$f":"M13*(1+N14)","v":114999.99999999999},{"$f":"N13*(1+O14)","v":132249.99999999997},{"$f":"O13*(1+P14)","v":145474.99999999997},{"$f":"P13*(1+Q14)","v":160022.49999999997}]
[null,null,null,null,null,null,null,null,null,null,null,null,0.2,0.15,0.15,0.1,0.1]
[null,"Price Increases",0.03]
[]
[]
[]
[]
[null,"Rev per R1",null,null,null,null,{"$f":"C91/1000000","v":8.5999999999999993E-2},{"$f":"G20","v":8.5999999999999993E-2},{"$f":"H20*(1+$C$15)","v":8.8579999999999992E-2},9.1237399999999996E-2,9.3974522000000005E-2,9.6793757660000007E-2,9.9697570389800011E-2,0.10268849750149402,0.10576915242653884,0.10894222699933501,0.11221049380931505]
{"$rows_left_out":95}
{"sheet":"RIVN_Forecast_Scenario","index":2,"n_rows":114,"n_cols":17,"rows_kept":114,"cut":false,"hidden":false,"merged":[]}
[]
[null,"Key Metrics (Annual)"]
[null,"Dollars in millions",null,"Actual",null,null,null,"Projected"]
[null,null,null,2021,2022,2023,2024,2025,2026,2027,2028,2029,2030,2031,2032,2033,2034]
[null,"Production",null,1015,24337,57232,49476]
[null,"Delivery",null,920,20332,50122,51579,44000,{"$f":"I7+I9+I11","v":63200},{"$f":"J7+J9+J11","v":82320},{"$f":"K7+K9+K11+K16","v":106796},116659.12000000002,127443.23360000004,139235.21468800004,152130.20650304007,166232.41512728328,181655.97965186596]
[null," R1",null,null,null,{"$f":"F6-F9","v":43332},{"$f":"G6-G9","v":40361},{"$f":"H6-H9","v":32000},35000,{"$f":"I7*(1+J8)","v":37800},40824,44089.920000000006,47617.113600000012,51426.482688000018,55540.601303040021,59983.849407283225,64782.557359865888]
[null,"  R1 Growth",null,null,null,null,null,null,null,0.08,0.08,0.08,0.08,0.08,0.08,0.08,0.08]
[null," RCV or EDV",null,null,null,{"$f":"SUM(G58:J58)","v":6790},{"$f":"SUM(K58:N58)","v":11218},12000,{"$f":"H9*(1+I10)","v":13200.000000000002},14520.000000000004,15972.000000000005,17569.200000000008,19326.12000000001,21258.732000000011,23384.605200000013,25723.065720000017,28295.372292000022]
[null,"  RCV Growth",null,null,null,null,{"$f":"G9/F9-1","v":0.65213549337260668},{"$f":"H9/G9-1","v":6.9709395614191427E-2},0.1,0.1,0.1,0.1,0.1,0.1,0.1,0.1,0.1]
[null," R2",null,null,null,null,null,null,15000,30000,50000,{"$f":"K11*(1+L12)","v":55000.000000000007},60500.000000000015,66550.000000000015,73205.000000000029,80525.500000000044,88578.050000000061]
[null,"  R2 Growth",null,null,null,null,null,null,null,null,null,0.1,0.1,0.1,0.1,0.1,0.1]
[null," R3",null,null,null,null,null,null,null,null,15000,30000,50000,{"$f":"M13*(1+N14)","v":55000.000000000007},{"$f":"N13*(1+O14)","v":60500.000000000015},{"$f":"O13*(1+P14)","v":66550.000000000015},{"$f":"P13*(1+Q14)","v":73205.000000000029}]
[null,null,null,null,null,null,null,null,null,null,null,null,0.1,0.1,0.1,0.1,0.1]
[null,"Price Increases",0.03]
[]
[]
[]
[]
[null,"Rev per R1",null,null,null,null,{"$f":"C91/1000000","v":8.5999999999999993E-2},{"$f":"G20","v":8.5999999999999993E-2},{"$f":"H20*(1+$C$15)","v":8.8579999999999992E-2},9.1237399999999996E-2,9.3974522000000005E-2,9.6793757660000007E-2,9.9697570389800011E-2,0.10268849750149402,0.10576915242653884,0.10894222699933501,0.11221049380931505]
{"$rows_left_out":95}
{"sheet":"RIVN_Comps","index":3,"n_rows":26,"n_cols":17,"rows_kept":26,"cut":false,"hidden":false,"merged":[]}
[]
[null,{"$f":"RIVN_DCF!C2&\"Valuation with Public Comparables\"","v":"Rivian AutomotiveValuation with Public Comparables"}]
[null,{"$f":"RIVN_DCF!B8","v":"Fiscal year ends in December USD in millions except per share data."}]
[null,"Valuation for period ended "]
[null,"Ticker",{"$f":"RIVN_DCF!C3","v":"RIVN"}]
[null,"Valuation Date"]
[null,"Company Name",{"$f":"RIVN_DCF!C2","v":"Rivian Automotive"},null,null,null,null,"Enterprise Value Multiples",null,null,null,null,null,"Equity Value Multiples"]
[null,null,null,null,null,"Market Value","Enterprise",null,null,null,"Forward","5 year growth","BV","Forward","Forward","Price(Market)-","Cash/MS as "]
[null,"Company","Ticker","Share price",null,"of Equity","Value","EV/Sales","EV/EBIT","EV/EBITDA","EPS","rate","Equity","P/E","PEG","to-Book","% of TA"]
[null,{"$f":"RIVN_DCF!C2","v":"Rivian Automotive"},{"$f":"C5","v":"RIVN"},{"$f":"RIVN_DCF!C4","v":14.68}]
[]
[]
[]
[]
[]
[]
[]
[]
[null,null,null,null,null,null,"High"]
[null,null,null,null,null,null,"Mean"]
{"$rows_left_out":7}
{"sheet":"Option_Value","index":4,"n_rows":30,"n_cols":7,"rows_kept":30,"cut":false,"hidden":false,"merged":[]}
[]
[null,"Valuing Options or Warrants"]
[null,"Enter the current stock price =",null,null,{"$f":"RIVN_DCF!S54","v":0}]
[null,"Enter the strike price on the option ="]
[null,"Enter the expiration of the option ="]
[null,"Enter the standard deviation in stock prices =",null,null,null,"(volatility)"]
[null,"Enter the annualized dividend yield on stock ="]
[null,"Enter the treasury bond rate ="]
[null,"Enter the number of options outstanding ="]
[null,"Enter the number of shares outstanding =",null,null,{"$f":"RIVN_DCF!F112","v":0}]
[]
[null,"Circuit Breaker","OFF"]
[]
[null,"Do not input any numbers below this line"]
[null,"VALUING WARRANTS WHEN THERE IS DILUTION"]
[null,"Stock Price=",null,{"$f":"E3","v":0},"# Warrants issued=",null,{"$f":"E9","v":0}]
[null,"Strike Price=",null,{"$f":"E4","v":0},"# Shares outstanding=",null,{"$f":"E10","v":0}]
[null,"Adjusted S =",null,{"$f":"(D16*G17+D29*G16)/(G17+G16)","v":{"$error":"#NUM!"}},"T.Bond rate=",null,{"$f":"E8","v":0}]
[null,"Adjusted K =",null,{"$f":"D17","v":0},"Variance=",null,{"$f":"E6^2","v":0}]
[null,"Expiration (in years) =",null,{"$f":"E5","v":0},"Annualized dividend yield=",null,{"$f":"E7","v":0}]
{"$rows_left_out":11}
{"sheet":"Warrant_Value","index":5,"n_rows":30,"n_cols":7,"rows_kept":30,"cut":false,"hidden":false,"merged":[]}
[]
[null,"Valuing Options or Warrants"]
[null,"Enter the current stock price =",null,null,{"$f":"RIVN_DCF!H63","v":0}]
[null,"Enter the strike price on the option =",null,null,6.84]
[null,"Enter the expiration of the option =",null,null,4]
[null,"Enter the standard deviation in stock prices =",null,null,0.625,"(volatility)"]
[null,"Enter the annualized dividend yield on stock =",null,null,0]
[null,"Enter the treasury bond rate =",null,null,{"$f":"RIVN_DCF!F124","v":4.1599999999999998E-2}]
[null,"Enter the number of options outstanding =",null,null,12]
[null,"Enter the number of shares outstanding =",null,null,{"$f":"RIVN_DCF!F112","v":0}]
[]
[null,"Circuit Breaker","ON"]
[]
[null,"Do not input any numbers below this line"]
[null,"VALUING WARRANTS WHEN THERE IS DILUTION"]
[null,"Stock Price=",null,{"$f":"E3","v":0},"# Warrants issued=",null,{"$f":"E9","v":12}]
[null,"Strike Price=",null,{"$f":"E4","v":6.84},"# Shares outstanding=",null,{"$f":"E10","v":0}]
[null,"Adjusted S =",null,{"$f":"(D16*G17+D29*G16)/(G17+G16)","v":0},"T.Bond rate=",null,{"$f":"E8","v":4.1599999999999998E-2}]
[null,"Adjusted K =",null,{"$f":"D17","v":6.84},"Variance=",null,{"$f":"E6^2","v":0.390625}]
[null,"Expiration (in years) =",null,{"$f":"E5","v":4},"Annualized dividend yield=",null,{"$f":"E7","v":0}]
{"$rows_left_out":11}
{"sheet":"Convertible_Debt","index":6,"n_rows":22,"n_cols":3,"rows_kept":22,"cut":false,"hidden":false,"merged":[]}
[]
[null,"2029 Green Convertible Debt"]
[null,"Face Value",1500]
[null,"Coupon Rate",4.6249999999999999E-2]
[null,"Last trade price",98.25]
[null,"Market Value of Debt",{"$f":"C3*C5/100","v":1473.75}]
[null,"Cost of debt",{"$f":"RIVN_DCF!F120","v":7.1599999999999997E-2}]
[null,"Time to Maturity",3.5]
[null,"Frequency",2]
[null,"Value of straight debt",{"$f":"-PV(C7/C9,C8*C9,C3*C4/C9,C3)","v":1384.0935195008551}]
[null,"Value of Equity Portion",{"$f":"C6-C10","v":89.656480499144891}]
[]
[null,"2030 Green Convertible Debt"]
[null,"Face Value",1725]
[null,"Coupon Rate",3.6249999999999998E-2]
[null,"Last trade price",85.67]
[null,"Market Value of Debt",{"$f":"C14*C16/100","v":1477.8074999999999}]
[null,"Cost of debt",{"$f":"RIVN_DCF!F120","v":7.1599999999999997E-2}]
[null,"Time to Maturity",5]
[null,"Frequency",2]
{"$rows_left_out":3}
{"sheet":"RIVN_IS","index":7,"n_rows":55,"n_cols":7,"rows_kept":55,"cut":false,"hidden":false,"merged":[]}
[]
[]
[]
[]
["Rivian Automotive, Inc. (NasdaqGS:RIVN) > Financials > Income Statement"]
[]
[null,"Template:","As Presented"," ","Restatement:","Latest Filings"]
[null,"Period Type:","Annual"," ","Order:","Latest on Right"]
[null,"Currency:","Reported Currency"," ","Conversion:","Historical"]
[null,"Units:","S&P Capital IQ (Default)"," ","Decimals:","Capital IQ (Default)"]
[null,"Source:","Capital IQ & Proprietary Data"," "]
[]
[]
["Income Statement",2019,2020,2021,2022,2023,2024]
["For the Fiscal Period Ending\n","12 months\nDec-31-2019","12 months\nDec-31-2020","12 months\nDec-31-2021","12 months\nDec-31-2022","12 months\nDec-31-2023","12 months\nDec-31-2024"]
["Currency","USD","USD","USD","USD","USD","USD"]
["Units","Millions","Millions","Millions","Millions","Millions","Millions"]
["Revenues"]
["Revenues: Automotive","-","-",null,1554,4132,4486]
["Revenues: Software Service","-","-","-",104,302,484]
{"$rows_left_out":36}
{"sheet":"RIVN_BS","index":8,"n_rows":57,"n_cols":7,"rows_kept":57,"cut":false,"hidden":false,"merged":[]}
[]
[]
[]
[]
["Rivian Automotive, Inc. (NasdaqGS:RIVN) > Financials > Balance Sheet"]
[]
[null,"Template:","As Presented"," ","Restatement:","Latest Filings"]
[null,"Period Type:","Annual"," ","Order:","Latest on Right"]
[null,"Currency:","Reported Currency"," ","Conversion:","Historical"]
[null,"Units:","S&P Capital IQ (Default)"," ","Decimals:","Capital IQ (Default)"]
[null,"Source:","Capital IQ & Proprietary Data"," "]
[]
[]
["Balance Sheet",2019,2020,2021,2022,2023,2024]
["Balance Sheet as of:\n","2019-12-31","2020-12-31","2021-12-31","2022-12-31","2023-12-31","2024-12-31"]
["Currency","USD","USD","USD","USD","USD","USD"]
["Units","Millions","Millions","Millions","Millions","Millions","Millions"]
["Current Assets"]
["  Cash and Cash Equivalents",2264,2979,18133,11568,7857,5294]
["  Short-term Investments",null,null,null,null,1511,2406]
{"$rows_left_out":38}
{"sheet":"RIVN_CFS","index":9,"n_rows":57,"n_cols":7,"rows_kept":57,"cut":false,"hidden":false,"merged":[]}
[]
[]
[]
[]
["Rivian Automotive, Inc. (NasdaqGS:RIVN) > Financials > Cash Flow"]
[]
[null,"Template:","As Presented"," ","Restatement:","Latest Filings"]
[null,"Period Type:","Annual"," ","Order:","Latest on Right"]
[null,"Currency:","Reported Currency"," ","Conversion:","Historical"]
[null,"Units:","S&P Capital IQ (Default)"," ","Decimals:","Capital IQ (Default)"]
[null,"Source:","Capital IQ & Proprietary Data"," "]
[]
[]
["Cash Flow"]
["For the Fiscal Period Ending\n","12 months\nDec-31-2019","12 months\nDec-31-2020","12 months\nDec-31-2021","12 months\nDec-31-2022","12 months\nDec-31-2023","12 months\nDec-31-2024"]
["Currency","USD","USD","USD","USD","USD","USD"]
["Units","Millions","Millions","Millions","Millions","Millions","Millions"]
["Operating Activities"]
["  Net Income",-426,-1018,-4688,-6752,-5432,-4746]
["  Depreciation and Amortization",7,29,197,652,937,1031]
{"$rows_left_out":37}